{"text_format":"1","workbook":"xlsx","n_sheets":14,"sheets":["Instructions","Streamlyne Budget Export to Exc","Summary","Editable Summary","Version Record","BudgetCalcs","SrPersons","OtherPersons","OtherPersonsCalc","Equipment","Part Support","Travel","Other","BudgetPeriods"],"not_rendered":{"charts":0,"images":0,"macros":1,"external_links":3,"defined_names":49,"comments":4,"pivot_tables":0},"unopened":[],"bounds":{"document_bytes":16777216,"sheet_cells":100000,"rows_first":2000,"rows_last":500,"rows_between":2000,"halvings":0,"cell_chars":16384,"cell_head_chars":4096},"cells_cut":0,"cells_raw":0,"read":"whole","date_system":"1900"}

{"sheet":"Instructions","index":0,"n_rows":52,"n_cols":13,"rows_kept":52,"cut":false,"hidden":false,"merged":[[33,2,33,16],[16,1,16,16]]}
[]
["Associated Streamlyne Report:",null,null,null,"Streamlyne Budget Export to Excel by PD Number-V2"]
[]
[]
["Generate an excel budget from a Streamlyne PD Budget."]
[null,"Run the Streamlyne Budget Export to Excel by PD Number-V2 report from within Streamlyne and select the PD number from the report."]
[null,"Export the results to .csv file."]
[null,"Open the .csv file in Excel"]
[null," "]
[null,"View your PD budget in the Summary sheet."]
[]
["Notes"]
[null,"These sheets are protected from unintentional modification. There is no password assigned, so you may intentionally modify any cells/sheets you want to."]
[]
[]
{"$rows_left_out":38}
{"sheet":"Streamlyne Budget Export to Exc","index":1,"n_rows":1,"n_cols":32,"rows_kept":1,"cut":false,"hidden":false,"merged":[]}
["PD #","Budget Period","Budget Period Start Date","Budget Period End Date","CATEGORY  TYPE","BUDGET  CATEGORY  CODE","Budget Category","Person Name","PI Flag","% Charged","% Effort","Cost Element","Cost Element Desc","Line Item Desc","Rate Type Desc","Requested Salary","Line Item Cost","Calculated Cost","RATE  CLASS  TYPE","RATE  CLASS  CODE","RATE  TYPE  CODE","Calculated Cost Sharing","Cost Sharing Amount","Underrecovery Amount","RATE  TYPE  DESCRIPTION","Person  Months","TITLE","SPONSOR  NAME","PI  FULL  NAME","DEADLINE  DATE","START  DATE","END  DATE"]

{"sheet":"Summary","index":2,"n_rows":165,"n_cols":32,"rows_kept":165,"cut":false,"hidden":false,"merged":[[8,29,11,29],[0,28,0,29],[1,28,1,29],[8,7,8,8],[8,9,8,10],[8,11,8,12],[8,13,8,14],[8,25,8,26],[8,27,11,27],[8,28,11,28],[8,15,8,16],[8,17,8,18],[8,19,8,20],[8,21,8,22],[8,23,8,24],[3,0,3,8]]}
[{"$f":"\"Project Budget Worksheet - \"&BudgetCalcs!F11","v":"Project Budget Worksheet - Iowa State University of Science and Technology"},null,null,null,null,null,null,null,null,null,null,null,null,null,null,null,null,null,null,null,null,null,null,null,null,null,null,null,"Version 2.02"]
[null,null,null,null,null,null,null,null,null,null,null,null,null,null,null,null,null,null,null,null,null,null,null,null,null,null,null,null,"Updated: 7/17/2023"]
[{"$f":"\"Program Sponsor: \"&BudgetPeriods!G2","v":"Program Sponsor: "}]
[{"$f":"\"Title: \"&BudgetPeriods!F2","v":"Title: "},null,null,null,null,null,null,null,null,null,null,null,null,null,null,null,null,null,null,null,null,null,null,null,null,null,null,null,null,null,"Negotiated Rate","Yes"]
[{"$f":"\"PI: \"&BudgetPeriods!H2","v":"PI: "},null,null,null,null,null,null,null,null,null,null,null,null,null,null,null,null,null,null,null,null,null,null,null,null,null,null,null,null,null,"Other TDC","No"]
[{"$f":"\"Period of Performance: \"&MONTH(MIN(BudgetPeriods!J:J))&\"/\"&DAY(MIN(BudgetPeriods!J:J))&\"/\"&YEAR(MIN(BudgetPeriods!J:J))&\" - \"&MONTH(MAX(BudgetPeriods!K:K))&\"/\"&DAY(MAX(BudgetPeriods!K:K))&\"/\"&YEAR(MAX(BudgetPeriods!K:K))","v":"Period of Performance: 1/0/1900 - 1/0/1900"},null,null,null,null,null,null,null,null,null,null,null,null,null,null,null,null,null,null,null,null,null,null,null,null,null,null,null,null,null,"Total Project Costs (USDA TFF)"]
[{"$f":"\"Deadline: \"&MONTH(BudgetPeriods!I2)&\"/\"&DAY(BudgetPeriods!I2)&\"/\"&YEAR(BudgetPeriods!I2)","v":"Deadline: 1/0/1900"},null,null,null,null,null,null,null,null,null,null,null,null,null,null,null,null,null,null,null,null,null,null,null,null,null,null,null,null,null,"Other MTDC"]
[null,null,null,null,null,null,null,1,1,2,2,3,3,4,4,5,5,6,6,7,7,8,8,9,9,10,10]
[{"$f":"\"Proposal Identification: \"&BudgetCalcs!B1","v":"Proposal Identification: 0"},null,null,null,null,null,null,{"$f":"IF(BudgetCalcs!$B$2>=H$8,BudgetCalcs!$F$9&\" \"&H$8,\"\")","v":""},null,{"$f":"IF(BudgetCalcs!$B$2>=J$8,BudgetCalcs!$F$9&\" \"&J$8,\"\")","v":""},null,{"$f":"IF(BudgetCalcs!$B$2>=L$8,BudgetCalcs!$F$9&\" \"&L$8,\"\")","v":""},null,{"$f":"IF(BudgetCalcs!$B$2>=N$8,BudgetCalcs!$F$9&\" \"&N$8,\"\")","v":""},null,{"$f":"IF(BudgetCalcs!$B$2>=P$8,BudgetCalcs!$F$9&\" \"&P$8,\"\")","v":""},null,{"$f":"IF(BudgetCalcs!$B$2>=R$8,BudgetCalcs!$F$9&\" \"&R$8,\"\")","v":""},null,{"$f":"IF(BudgetCalcs!$B$2>=T$8,BudgetCalcs!$F$9&\" \"&T$8,\"\")","v":""},null,{"$f":"IF(BudgetCalcs!$B$2>=V$8,BudgetCalcs!$F$9&\" \"&V$8,\"\")","v":""},null,{"$f":"IF(BudgetCalcs!$B$2>=X$8,BudgetCalcs!$F$9&\" \"&X$8,\"\")","v":""},null,{"$f":"IF(BudgetCalcs!$B$2>=Z$8,BudgetCalcs!$F$9&\" \"&Z$8,\"\")","v":""},null,"Total Sponsor Funds","Total Cost-Shared Matching Funds","Total Project Funds"]
[null,null,null,null,null,null,null,"Start Date","End Date","Start Date","End Date","Start Date","End Date","Start Date ","End Date","Start Date ","End Date","Start Date ","End Date","Start Date ","End Date","Start Date ","End Date","Start Date ","End Date","Start Date","End Date"]
[null,null,null,null,null,null,null,{"$f":"IFERROR(INDIRECT(\"'BudgetPeriods'!B\"&MATCH(1,BudgetPeriods!$A:$A,0)),\"\")","v":""},{"$f":"IFERROR(INDIRECT(\"'BudgetPeriods'!C\"&MATCH(1,BudgetPeriods!$A:$A,0)),\"\")","v":""},{"$f":"IFERROR(INDIRECT(\"'BudgetPeriods'!B\"&MATCH(2,BudgetPeriods!$A:$A,0)),\"\")","v":""},{"$f":"IFERROR(INDIRECT(\"'BudgetPeriods'!C\"&MATCH(2,BudgetPeriods!$A:$A,0)),\"\")","v":""},{"$f":"IFERROR(INDIRECT(\"'BudgetPeriods'!B\"&MATCH(3,BudgetPeriods!$A:$A,0)),\"\")","v":""},{"$f":"IFERROR(INDIRECT(\"'BudgetPeriods'!C\"&MATCH(3,BudgetPeriods!$A:$A,0)),\"\")","v":""},{"$f":"IFERROR(INDIRECT(\"'BudgetPeriods'!B\"&MATCH(4,BudgetPeriods!$A:$A,0)),\"\")","v":""},{"$f":"IFERROR(INDIRECT(\"'BudgetPeriods'!C\"&MATCH(4,BudgetPeriods!$A:$A,0)),\"\")","v":""},{"$f":"IFERROR(INDIRECT(\"'BudgetPeriods'!B\"&MATCH(4,BudgetPeriods!$A:$A,0)),\"\")","v":""},{"$f":"IFERROR(INDIRECT(\"'BudgetPeriods'!C\"&MATCH(4,BudgetPeriods!$A:$A,0)),\"\")","v":""},{"$f":"IFERROR(INDIRECT(\"'BudgetPeriods'!B\"&MATCH(4,BudgetPeriods!$A:$A,0)),\"\")","v":""},{"$f":"IFERROR(INDIRECT(\"'BudgetPeriods'!C\"&MATCH(4,BudgetPeriods!$A:$A,0)),\"\")","v":""},{"$f":"IFERROR(INDIRECT(\"'BudgetPeriods'!B\"&MATCH(4,BudgetPeriods!$A:$A,0)),\"\")","v":""},{"$f":"IFERROR(INDIRECT(\"'BudgetPeriods'!C\"&MATCH(4,BudgetPeriods!$A:$A,0)),\"\")","v":""},{"$f":"IFERROR(INDIRECT(\"'BudgetPeriods'!B\"&MATCH(4,BudgetPeriods!$A:$A,0)),\"\")","v":""},{"$f":"IFERROR(INDIRECT(\"'BudgetPeriods'!C\"&MATCH(4,BudgetPeriods!$A:$A,0)),\"\")","v":""},{"$f":"IFERROR(INDIRECT(\"'BudgetPeriods'!B\"&MATCH(4,BudgetPeriods!$A:$A,0)),\"\")","v":""},{"$f":"IFERROR(INDIRECT(\"'BudgetPeriods'!C\"&MATCH(4,BudgetPeriods!$A:$A,0)),\"\")","v":""},{"$f":"IFERROR(INDIRECT(\"'BudgetPeriods'!B\"&MATCH(5,BudgetPeriods!$A:$A,0)),\"\")","v":""},{"$f":"IFERROR(INDIRECT(\"'BudgetPeriods'!C\"&MATCH(5,BudgetPeriods!$A:$A,0)),\"\")","v":""}]
[null,null,null,null,null,null,null,"Sponsor Funds Requested","Cost-Shared  Matching Funds","Sponsor Funds Requested","Cost-Shared  Matching Funds","Sponsor Funds Requested","Cost-Shared  Matching Funds","Sponsor Funds Requested","Cost-Shared  Matching Funds","Sponsor Funds Requested","Cost-Shared  Matching Funds","Sponsor Funds Requested","Cost-Shared  Matching Funds","Sponsor Funds Requested","Cost-Shared  Matching Funds","Sponsor Funds Requested","Cost-Shared  Matching Funds","Sponsor Funds Requested","Cost-Shared  Matching Funds","Sponsor Funds Requested","Cost-Shared  Matching Funds"]
[]
["A",null,"Key Personnel","Person Months",null,null,null,{"$f":"SUM(H15:H34)","v":0},0,0,0,0,0,0,0,{"$f":"SUM(P15:P34)","v":0},0,0,0,0,0,0,0,0,0,0,0,{"$f":"SUM(H14+J14+L14+N14+P14+R14+T14+V14+X14+Z14)","v":0},{"$f":"SUM(I14+K14+M14+O14+Q14+S14+U14+W14+Y14+AA14)","v":0},{"$f":"SUM(AB14+AC14)","v":0}]
[null,1,{"$f":"INDIRECT(\"SrPersons!A2:A\"&SrPersons!C1)","v":0},{"$f":"IFERROR(SUMIFS(SrPersons!$AB:$AB,SrPersons!$D:$D,$H$8,SrPersons!$J:$J,$C15) / COUNTIFS(SrPersons!$D:$D,$H$8,SrPersons!$J:$J,$C15),\"\")","v":""},null,null,null,{"$f":"IFERROR(SUMIFS(SrPersons!$R:$R,SrPersons!$D:$D,H$8,SrPersons!$J:$J,$C15) / COUNTIFS(SrPersons!$D:$D,H$8,SrPersons!$J:$J,$C15),0)","v":0},{"$f":"IFERROR(SUMIFS(SrPersons!$Y:$Y,SrPersons!$D:$D,I$8,SrPersons!$J:$J,$C15) / COUNTIFS(SrPersons!$D:$D,I$8,SrPersons!$J:$J,$C15),0)","v":0},{"$f":"IFERROR(SUMIFS(SrPersons!$R:$R,SrPersons!$D:$D,J$8,SrPersons!$J:$J,$C15) / COUNTIFS(SrPersons!$D:$D,J$8,SrPersons!$J:$J,$C15),0)","v":0},{"$f":"IFERROR(SUMIFS(SrPersons!$Y:$Y,SrPersons!$D:$D,K$8,SrPersons!$J:$J,$C15) / COUNTIFS(SrPersons!$D:$D,K$8,SrPersons!$J:$J,$C15),0)","v":0},{"$f":"IFERROR(SUMIFS(SrPersons!$R:$R,SrPersons!$D:$D,L$8,SrPersons!$J:$J,$C15) / COUNTIFS(SrPersons!$D:$D,L$8,SrPersons!$J:$J,$C15),0)","v":0},{"$f":"IFERROR(SUMIFS(SrPersons!$Y:$Y,SrPersons!$D:$D,M$8,SrPersons!$J:$J,$C15) / COUNTIFS(SrPersons!$D:$D,M$8,SrPersons!$J:$J,$C15),0)","v":0},{"$f":"IFERROR(SUMIFS(SrPersons!$R:$R,SrPersons!$D:$D,N$8,SrPersons!$J:$J,$C15) / COUNTIFS(SrPersons!$D:$D,N$8,SrPersons!$J:$J,$C15),0)","v":0},{"$f":"IFERROR(SUMIFS(SrPersons!$Y:$Y,SrPersons!$D:$D,O$8,SrPersons!$J:$J,$C15) / COUNTIFS(SrPersons!$D:$D,O$8,SrPersons!$J:$J,$C15),0)","v":0},{"$f":"IFERROR(SUMIFS(SrPersons!$R:$R,SrPersons!$D:$D,P$8,SrPersons!$J:$J,$C15) / COUNTIFS(SrPersons!$D:$D,P$8,SrPersons!$J:$J,$C15),0)","v":0},{"$f":"IFERROR(SUMIFS(SrPersons!$Y:$Y,SrPersons!$D:$D,Q$8,SrPersons!$J:$J,$C15) / COUNTIFS(SrPersons!$D:$D,Q$8,SrPersons!$J:$J,$C15),0)","v":0},{"$f":"IFERROR(SUMIFS(SrPersons!$R:$R,SrPersons!$D:$D,R$8,SrPersons!$J:$J,$C15) / COUNTIFS(SrPersons!$D:$D,R$8,SrPersons!$J:$J,$C15),0)","v":0},{"$f":"IFERROR(SUMIFS(SrPersons!$Y:$Y,SrPersons!$D:$D,S$8,SrPersons!$J:$J,$C15) / COUNTIFS(SrPersons!$D:$D,S$8,SrPersons!$J:$J,$C15),0)","v":0},{"$f":"IFERROR(SUMIFS(SrPersons!$R:$R,SrPersons!$D:$D,T$8,SrPersons!$J:$J,$C15) / COUNTIFS(SrPersons!$D:$D,T$8,SrPersons!$J:$J,$C15),0)","v":0},{"$f":"IFERROR(SUMIFS(SrPersons!$Y:$Y,SrPersons!$D:$D,U$8,SrPersons!$J:$J,$C15) / COUNTIFS(SrPersons!$D:$D,U$8,SrPersons!$J:$J,$C15),0)","v":0},{"$f":"IFERROR(SUMIFS(SrPersons!$R:$R,SrPersons!$D:$D,V$8,SrPersons!$J:$J,$C15) / COUNTIFS(SrPersons!$D:$D,V$8,SrPersons!$J:$J,$C15),0)","v":0},{"$f":"IFERROR(SUMIFS(SrPersons!$Y:$Y,SrPersons!$D:$D,W$8,SrPersons!$J:$J,$C15) / COUNTIFS(SrPersons!$D:$D,W$8,SrPersons!$J:$J,$C15),0)","v":0},{"$f":"IFERROR(SUMIFS(SrPersons!$R:$R,SrPersons!$D:$D,X$8,SrPersons!$J:$J,$C15) / COUNTIFS(SrPersons!$D:$D,X$8,SrPersons!$J:$J,$C15),0)","v":0},{"$f":"IFERROR(SUMIFS(SrPersons!$Y:$Y,SrPersons!$D:$D,Y$8,SrPersons!$J:$J,$C15) / COUNTIFS(SrPersons!$D:$D,Y$8,SrPersons!$J:$J,$C15),0)","v":0},{"$f":"IFERROR(SUMIFS(SrPersons!$R:$R,SrPersons!$D:$D,Z$8,SrPersons!$J:$J,$C15) / COUNTIFS(SrPersons!$D:$D,Z$8,SrPersons!$J:$J,$C15),0)","v":0},{"$f":"IFERROR(SUMIFS(SrPersons!$Y:$Y,SrPersons!$D:$D,AA$8,SrPersons!$J:$J,$C15) / COUNTIFS(SrPersons!$D:$D,AA$8,SrPersons!$J:$J,$C15),0)","v":0},{"$f":"SUM(H15+J15+L15+N15+P15+R15+T15+V15+X15+Z15)","v":0},{"$f":"SUM(I15+K15+M15+O15+Q15+S15+U15+W15+Y15+AA15)","v":0},{"$f":"SUM(AB15+AC15)","v":0}]
{"$rows_left_out":151}
{"sheet":"Editable Summary","index":3,"n_rows":165,"n_cols":30,"rows_kept":165,"cut":false,"hidden":false,"merged":[[3,0,3,8],[8,7,8,8],[8,9,8,10],[8,11,8,12],[8,13,8,14],[8,27,11,27],[8,28,11,28],[8,29,11,29],[0,28,0,29],[1,28,1,29],[8,21,8,22],[8,23,8,24],[8,25,8,26],[8,15,8,16],[8,17,8,18],[8,19,8,20]]}
["Project Budget Worksheet - Iowa State University of Science and Technology",null,null,null,null,null,null,null,null,null,null,null,null,null,null,null,null,null,null,null,null,null,null,null,null,null,null,null,"Version 2"]
[null,null,null,null,null,null,null,null,null,null,null,null,null,null,null,null,null,null,null,null,null,null,null,null,null,null,null,null,"Updated: 5/11/2023"]
["Program Sponsor: "]
["Title: "]
["PI: "]
["Period of Performance: 1/0/1900 - 1/0/1900"]
["Deadline: 1/0/1900"]
[null,null,null,null,null,null,null,1,1,2,2,3,3,4,4,5,5,6,6,7,7,8,8,9,9,10,10]
["Proposal Identification: 0",null,null,null,null,null,null,"",null,"",null,"",null,"",null,"",null,"",null,"",null,"",null,"",null,"",null,"Total Sponsor Funds","Total Cost-Shared Matching Funds","Total Project Funds"]
[null,null,null,null,null,null,null,"Start Date","End Date","Start Date","End Date","Start Date","End Date","Start Date ","End Date","Start Date ","End Date","Start Date ","End Date","Start Date ","End Date","Start Date ","End Date","Start Date ","End Date","Start Date","End Date"]
[null,null,null,null,null,null,null,"","","","","","","","","","","","","","","","","","","",""]
[null,null,null,null,null,null,null,"Sponsor Funds Requested","Cost-Shared  Matching Funds","Sponsor Funds Requested","Cost-Shared  Matching Funds","Sponsor Funds Requested","Cost-Shared  Matching Funds","Sponsor Funds Requested","Cost-Shared  Matching Funds","Sponsor Funds Requested","Cost-Shared  Matching Funds","Sponsor Funds Requested","Cost-Shared  Matching Funds","Sponsor Funds Requested","Cost-Shared  Matching Funds","Sponsor Funds Requested","Cost-Shared  Matching Funds","Sponsor Funds Requested","Cost-Shared  Matching Funds","Sponsor Funds Requested","Cost-Shared  Matching Funds"]
[]
["A",null,"Key Personnel","Person Months",null,null,null,{"$f":"SUM(H15:H34)","v":0},0,0,0,0,0,0,0,{"$f":"SUM(P15:P34)","v":0},0,0,0,0,0,0,0,0,0,0,0,{"$f":"SUM(H14+J14+L14+N14+P14+R14+T14+V14+X14+Z14)","v":0},{"$f":"SUM(I14+K14+M14+O14+Q14+S14+U14+W14+Y14+AA14)","v":0},{"$f":"SUM(AB14+AC14)","v":0}]
[null,1,0,"",null,null,null,0,0,0,0,0,0,0,0,0,0,0,0,0,0,0,0,0,0,0,0,{"$f":"SUM(H15+J15+L15+N15+P15+R15+T15+V15+X15+Z15)","v":0},{"$f":"SUM(I15+K15+M15+O15+Q15+S15+U15+W15+Y15+AA15)","v":0},{"$f":"SUM(AB15+AC15)","v":0}]
{"$rows_left_out":151}
{"sheet":"Version Record","index":4,"n_rows":17,"n_cols":14,"rows_kept":17,"cut":false,"hidden":false,"merged":[]}
["Version","Released","Changes",null,null,null,null,null,null,null,null,null,"Future enhancements:"]
[1,"2023-05-11",null,null,null,null,null,null,null,null,null,null,null,"autoload & copy data from the report workbook to this workbook"]
[2,"2023-05-23","Requires use of new Streamlyne Budget Export to Excel by PD-V2"]
[null,null,"remove Monthly Salary column from Key Personnel and Other Personnel sections"]
[null,null,"remove 0's from Number of Persons column in the Other Personnel section when empty"]
[null,null,"increase max number of Key and Other Personnel from 15 to 20"]
[null,null,"Merge Title to end of column I, wrap text and align top/left"]
[null,null,"increase max number of periods from 5 to 10"]
[null,null,"add person months to Key Personnel and Other Personnel"]
[null,null,"These 2 items required use of Macros and conversion of .xls file to .xslm format"]
[null,null,null,"add buttons to collapse unused budget periods and rows in personnel, fringe and other direct cost sections"]
[null,null,null,"add editable version of Summary"]
[2.0099999999999998,"2023-05-25","fix bug in Summary tab \"Period x\" calculation in periods 4-10"]
[2.02,"2023-07-17","fix bug in Summary tab > columns AB & AC to add all 10 periods into totals"]
[null,null,"added conditions in Summary tab > cell D159 for USDA TFFA and S&W calculation of IDC Rate %"]
{"$rows_left_out":3}
{"sheet":"BudgetCalcs","index":5,"n_rows":31,"n_cols":14,"rows_kept":31,"cut":false,"hidden":true,"merged":[[14,7,14,8],[21,1,22,3]]}
["PD",{"$f":"'Streamlyne Budget Export to Exc'!A2","v":0},null,null,null,"Budget Category Code","Budget Category Type Code","Domestic Travel Budget Category Code","Foreign Travel Budget Category Code","Stipend Budget Category Code","Travel Budget Category Code","Subsistence Budget Category Code","Tuition Budget Category Code","Other Budget Category Code"]
["Budget Periods",{"$f":"MAX('Streamlyne Budget Export to Exc'!B:B)","v":0},null,null,"Sr Persons",1,"P"]
["Total Budget Lines ",{"$f":"COUNTA('Streamlyne Budget Export to Exc'!A:A)","v":1},null,null,"other Persons",{"$f":"\"<> \"&F2","v":"<> 1"},"P"]
["Total Report Columns",{"$f":"IF(INT((C4-1)/26)<1,MID(\"ABCDEFGHIJKLMNOPQRSTUVWXYZ\",C4,1),\"A\"&MID(\"ABCDEFGHIJKLMNOPQRSTUVWXYZ\",MOD(C4,26),1))","v":"AF"},{"$f":"COUNTA('Streamlyne Budget Export to Exc'!1:1)","v":32},null,"Equipment",null,"E"]
["Total Budget Columns",{"$f":"IF(INT((C5-1)/26)<1,MID(\"ABCDEFGHIJKLMNOPQRSTUVWXYZ\",C5,1),\"A\"&MID(\"ABCDEFGHIJKLMNOPQRSTUVWXYZ\",MOD(C5,26),1))","v":"Z"},{"$f":"C4-6","v":26},null,"Participant Support",null,"S",null,null,32,31,36,35,2]
["Sr Persons Filter Areas",{"$f":"\"B2:\"&B$5&(B$3)","v":"B2:Z1"},{"$f":"\"F2:F\"&(B3)","v":"F2:F1"},null,"Travel",null,"T",7,23]
["Other Persons Filter Areas",{"$f":"\"B2:\"&B$5&(B$3)","v":"B2:Z1"},{"$f":"\"E2:E\"&(B3)","v":"E2:E1"},null,"Other Direct",null,"O"]
["Budget Period Filter Area"]
["OH Type",{"$f":"OFFSET('Streamlyne Budget Export to Exc'!Y1,MATCH(\"O\",'Streamlyne Budget Export to Exc'!S:S,0)-1,0)","v":{"$error":"#N/A"}},null,null,"Rename Budget Period ","Period"]
[]
[null,null,null,null,"School Name for Report","Iowa State University of Science and Technology"]
[]
[]
[null,null,null,null,"Other Direct Summary"]
[null,null,null,null,"Line","Label","Budget Category Code","subrecipient Object Code ID",null,"exclude from MTDC base (indicate with an 'x')"]
{"$rows_left_out":17}
{"sheet":"SrPersons","index":6,"n_rows":2,"n_cols":28,"rows_kept":2,"cut":false,"hidden":true,"merged":[]}
["Key Persons",{"$f":"COUNTA(D:D)","v":2},{"$f":"COUNTA(A:A)","v":2},"Budget Period","Budget Period Start Date","Budget Period End Date","CATEGORY  TYPE","BUDGET  CATEGORY  CODE","Budget Category","Person Name","PI Flag","% Charged","% Effort","Cost Element","Cost Element Desc","Line Item Desc","Rate Type Desc","Requested Salary","Line Item Cost","Calculated Cost","RATE  CLASS  TYPE","RATE  CLASS  CODE","RATE  TYPE  CODE","Calculated Cost Sharing","Cost Sharing Amount","Underrecovery Amount","RATE  TYPE  DESCRIPTION","Person Months"]
[{"$f":"_xlfn.UNIQUE(INDIRECT(\"J2:K\"&B1))","v":0},0,null,{"$f":"_xlfn._xlws.FILTER(INDIRECT(\"'Streamlyne Budget Export to Exc'!\"&BudgetCalcs!B6),INDIRECT(\"'Streamlyne Budget Export to Exc'!\"&BudgetCalcs!C6)=BudgetCalcs!F2,)","v":{"$error":"#VALUE!"}}]

{"sheet":"OtherPersons","index":7,"n_rows":2,"n_cols":29,"rows_kept":2,"cut":false,"hidden":true,"merged":[]}
["Other Persons",{"$f":"COUNTA(E:E)","v":2},{"$f":"COUNTA(A:A)","v":2},null,"Budget Period","Budget Period Start Date","Budget Period End Date","CATEGORY  TYPE","BUDGET  CATEGORY  CODE","Budget Category","Person Name","PI Flag","% Charged","% Effort","Cost Element","Cost Element Desc","Line Item Desc","Rate Type Desc","Requested Salary","Line Item Cost","Calculated Cost","RATE  CLASS  TYPE","RATE  CLASS  CODE","RATE  TYPE  CODE","Calculated Cost Sharing","Cost Sharing Amount","Underrecovery Amount","RATE  TYPE  DESCRIPTION","Person Months"]
[{"$f":"_xlfn.UNIQUE(INDIRECT(\"J2:J\"&B1))","v":0},{"$f":"_xlfn.UNIQUE(INDIRECT(\"J2:K\"&B1))","v":0},0,null,{"$f":"_xlfn._xlws.FILTER(INDIRECT(\"'Streamlyne Budget Export to Exc'!\"&BudgetCalcs!B7),(INDIRECT(\"'Streamlyne Budget Export to Exc'!\"&BudgetCalcs!C7)=BudgetCalcs!G3)*(INDIRECT(\"'Streamlyne Budget Export to Exc'!\"&BudgetCalcs!C6)<>BudgetCalcs!F2),)","v":{"$error":"#VALUE!"}}]

{"sheet":"OtherPersonsCalc","index":8,"n_rows":17,"n_cols":19,"rows_kept":17,"cut":false,"hidden":true,"merged":[]}
["Budget Period","Budget Period Start Date","Budget Period End Date","CATEGORY  TYPE","BUDGET  CATEGORY  CODE","Budget Category","Person Name",null,{"$f":"INDIRECT(\"'OtherPersons'!A1:A\"&OtherPersons!C1)","v":"Other Persons"},1,2,3,4,5,6,7,8,9,10]
[{"$f":"_xlfn.UNIQUE(INDIRECT(\"'OtherPersons'!E2:K\"&OtherPersons!B1))","v":{"$error":"#VALUE!"}},"00:00:00","00:00:00",0,0,0,0,null,0,{"$f":"COUNTIFS($A:$A,J$1,$F:$F,$I2)","v":0},{"$f":"COUNTIFS($A:$A,K$1,$F:$F,$I2)","v":0},0,0,0,0,0,0,0,0]
[null,null,null,null,null,null,null,null,null,{"$f":"COUNTIFS($A:$A,J$1,$F:$F,$I3)","v":0},0,0,0,0,0,0,0,0,0]
[null,null,null,null,null,null,null,null,null,0,0,0,0,0,0,0,0,0,0]
[null,null,null,null,null,null,null,null,null,0,0,0,0,0,0,0,0,0,0]
[null,null,null,null,null,null,null,null,null,0,0,0,0,0,0,0,0,0,0]
[null,null,null,null,null,null,null,null,null,0,0,0,0,0,0,0,0,0,0]
[null,null,null,null,null,null,null,null,null,0,0,0,0,0,0,0,0,0,0]
[null,null,null,null,null,null,null,null,null,0,0,0,0,0,0,0,0,0,0]
[null,null,null,null,null,null,null,null,null,0,0,0,0,0,0,0,0,0,0]
[null,null,null,null,null,null,null,null,null,0,0,0,0,0,0,0,0,0,0]
[null,null,null,null,null,null,null,null,null,0,0,0,0,0,0,0,0,0,0]
[null,null,null,null,null,null,null,null,null,0,0,0,0,0,0,0,0,0,0]
[null,null,null,null,null,null,null,null,null,0,0,0,0,0,0,0,0,0,0]
[null,null,null,null,null,null,null,null,null,0,0,0,0,0,0,0,0,0,0]
{"$rows_left_out":3}
{"sheet":"Equipment","index":9,"n_rows":2,"n_cols":25,"rows_kept":2,"cut":false,"hidden":true,"merged":[]}
["Budget Period","Budget Period Start Date","Budget Period End Date","CATEGORY  TYPE","BUDGET  CATEGORY  CODE","Budget Category","Person Name","PI Flag","% Charged","% Effort","Cost Element","Cost Element Desc","Line Item Desc","Rate Type Desc","Requested Salary","Line Item Cost","Calculated Cost","RATE  CLASS  TYPE","RATE  CLASS  CODE","RATE  TYPE  CODE","Calculated Cost Sharing","Cost Sharing Amount","Underrecovery Amount","RATE  TYPE  DESCRIPTION","Person Months"]
[{"$f":"_xlfn._xlws.FILTER(INDIRECT(\"'Streamlyne Budget Export to Exc'!\"&BudgetCalcs!B7),INDIRECT(\"'Streamlyne Budget Export to Exc'!\"&BudgetCalcs!C7)=BudgetCalcs!G4,)","v":{"$error":"#VALUE!"}}]

{"sheet":"Part Support","index":10,"n_rows":2,"n_cols":25,"rows_kept":2,"cut":false,"hidden":true,"merged":[]}
["Budget Period","Budget Period Start Date","Budget Period End Date","CATEGORY  TYPE","BUDGET  CATEGORY  CODE","Budget Category","Person Name","PI Flag","% Charged","% Effort","Cost Element","Cost Element Desc","Line Item Desc","Rate Type Desc","Requested Salary","Line Item Cost","Calculated Cost","RATE  CLASS  TYPE","RATE  CLASS  CODE","RATE  TYPE  CODE","Calculated Cost Sharing","Cost Sharing Amount","Underrecovery Amount","RATE  TYPE  DESCRIPTION","Person Months"]
[{"$f":"_xlfn._xlws.FILTER(INDIRECT(\"'Streamlyne Budget Export to Exc'!\"&BudgetCalcs!B7),INDIRECT(\"'Streamlyne Budget Export to Exc'!\"&BudgetCalcs!C7)=BudgetCalcs!G5,)","v":{"$error":"#VALUE!"}}]

{"sheet":"Travel","index":11,"n_rows":2,"n_cols":25,"rows_kept":2,"cut":false,"hidden":true,"merged":[]}
["Budget Period","Budget Period Start Date","Budget Period End Date","CATEGORY  TYPE","BUDGET  CATEGORY  CODE","Budget Category","Person Name","PI Flag","% Charged","% Effort","Cost Element","Cost Element Desc","Line Item Desc","Rate Type Desc","Requested Salary","Line Item Cost","Calculated Cost","RATE  CLASS  TYPE","RATE  CLASS  CODE","RATE  TYPE  CODE","Calculated Cost Sharing","Cost Sharing Amount","Underrecovery Amount","RATE  TYPE  DESCRIPTION","Person Months"]
[{"$f":"_xlfn._xlws.FILTER(INDIRECT(\"'Streamlyne Budget Export to Exc'!\"&BudgetCalcs!B7),INDIRECT(\"'Streamlyne Budget Export to Exc'!\"&BudgetCalcs!C7)=BudgetCalcs!G6,)","v":{"$error":"#VALUE!"}}]

{"sheet":"Other","index":12,"n_rows":2,"n_cols":25,"rows_kept":2,"cut":false,"hidden":true,"merged":[]}
["Budget Period","Budget Period Start Date","Budget Period End Date","CATEGORY  TYPE","BUDGET  CATEGORY  CODE","Budget Category","Person Name","PI Flag","% Charged","% Effort","Cost Element","Cost Element Desc","Line Item Desc","Rate Type Desc","Requested Salary","Line Item Cost","Calculated Cost","RATE  CLASS  TYPE","RATE  CLASS  CODE","RATE  TYPE  CODE","Calculated Cost Sharing","Cost Sharing Amount","Underrecovery Amount","RATE  TYPE  DESCRIPTION","Person Months"]
[{"$f":"_xlfn._xlws.FILTER(INDIRECT(\"'Streamlyne Budget Export to Exc'!\"&BudgetCalcs!B7),INDIRECT(\"'Streamlyne Budget Export to Exc'!\"&BudgetCalcs!C7)=BudgetCalcs!G7,)","v":{"$error":"#VALUE!"}}]

{"sheet":"BudgetPeriods","index":13,"n_rows":1,"n_cols":11,"rows_kept":1,"cut":false,"hidden":true,"merged":[]}
[{"$f":"_xlfn.UNIQUE(INDIRECT(\"'Streamlyne Budget Export to Exc'!B1:D\"&BudgetCalcs!B3),)","v":"Budget Period"},"Budget Period Start Date","Budget Period End Date",null,null,{"$f":"_xlfn.UNIQUE(INDIRECT(\"'Streamlyne Budget Export to Exc'!AA1:AF\"&BudgetCalcs!B3),)","v":"TITLE"},"SPONSOR  NAME","PI  FULL  NAME","DEADLINE  DATE","START  DATE","END  DATE"]