{"text_format":"1","workbook":"xlsx","n_sheets":16,"sheets":["Instructions","Streamlyne Budget Export to Exc","Summary","Editable Summary","SPA Budget","Editable SPA Budget","Version Record","BudgetCalcs","SrPersons","OtherPersons","OtherPersonsCalc","Equipment","Part Support","Travel","Other","BudgetPeriods"],"not_rendered":{"charts":0,"images":0,"macros":1,"external_links":3,"defined_names":61,"comments":4,"pivot_tables":0},"unopened":[],"bounds":{"document_bytes":16777216,"sheet_cells":100000,"rows_first":2000,"rows_last":500,"rows_between":2000,"halvings":0,"cell_chars":16384,"cell_head_chars":4096},"cells_cut":0,"cells_raw":0,"read":"whole","date_system":"1900"}

{"sheet":"Instructions","index":0,"n_rows":77,"n_cols":13,"rows_kept":77,"cut":false,"hidden":false,"merged":[[76,0,76,4],[56,2,56,16],[34,2,34,16],[16,1,16,16],[58,6,58,7],[64,6,65,7],[66,0,67,2]]}
[]
["Associated Streamlyne Report:",null,null,null,"Streamlyne Budget Export to Excel by PD Number-V2"]
[]
[]
["Generate an excel budget from a Streamlyne PD Budget."]
[null,"Run the Streamlyne Budget Export to Excel by PD Number-V2 report from within Streamlyne and select the PD number from the report."]
[null,"Export the results to .csv file."]
[null,"Open the .csv file in Excel"]
[null,"Copy the entire sheet from the exported excel file by clicking on the triangle to the left of column A and above row 1."]
[null,"Paste into cell A1 in worksheet: Streamlyne Budget Export to Excel by PD-V2.05"]
{"$rows_left_out":68}
{"sheet":"Streamlyne Budget Export to Exc","index":1,"n_rows":1,"n_cols":32,"rows_kept":1,"cut":false,"hidden":false,"merged":[]}
["PD #","Budget Period","Budget Period Start Date","Budget Period End Date","CATEGORY  TYPE","BUDGET  CATEGORY  CODE","Budget Category","Person Name","PI Flag","% Charged","% Effort","Cost Element","Cost Element Desc","Line Item Desc","Rate Type Desc","Requested Salary","Line Item Cost","Calculated Cost","RATE  CLASS  TYPE","RATE  CLASS  CODE","RATE  TYPE  CODE","Calculated Cost Sharing","Cost Sharing Amount","Underrecovery Amount","RATE  TYPE  DESCRIPTION","Person  Months","TITLE","SPONSOR  NAME","PI  FULL  NAME","DEADLINE  DATE","START  DATE","END  DATE"]

{"sheet":"Summary","index":2,"n_rows":163,"n_cols":32,"rows_kept":163,"cut":false,"hidden":false,"merged":[[8,29,11,29],[0,28,0,29],[1,28,1,29],[8,7,8,8],[8,9,8,10],[8,11,8,12],[8,13,8,14],[8,25,8,26],[8,27,11,27],[8,28,11,28],[8,15,8,16],[8,17,8,18],[8,19,8,20],[8,21,8,22],[8,23,8,24],[3,0,3,8]]}
[{"$f":"\"Project Budget Worksheet - \"&BudgetCalcs!F11","v":"Project Budget Worksheet - Iowa State University of Science and Technology"},null,null,null,null,null,null,null,null,null,null,null,null,null,null,null,null,null,null,null,null,null,null,null,null,null,null,null,{"$f":"\"Version: \"&'Version Record'!$B$1","v":"Version: 2.06"}]
[null,null,null,null,null,null,null,null,null,null,null,null,null,null,null,null,null,null,null,null,null,null,null,null,null,null,null,null,{"$f":"\"Updated: \"& MONTH('Version Record'!$B$2)&\"/\"&DAY('Version Record'!$B$2)&\"/\"&YEAR('Version Record'!$B$2)","v":"Updated: 7/19/2024"}]
[{"$f":"\"Program Sponsor: \"&BudgetPeriods!G2","v":"Program Sponsor: "}]
[{"$f":"\"Title: \"&BudgetPeriods!F2","v":"Title: "},null,null,null,null,null,null,null,null,null,null,null,null,null,null,null,null,null,null,null,null,null,null,null,null,null,null,null,null,null,"Negotiated Rate","Yes"]
[{"$f":"\"PI: \"&BudgetPeriods!H2","v":"PI: "},null,null,null,null,null,null,null,null,null,null,null,null,null,null,null,null,null,null,null,null,null,null,null,null,null,null,null,null,null,"Other TDC","No"]
[{"$f":"\"Period of Performance: \"&MONTH(MIN(BudgetPeriods!J:J))&\"/\"&DAY(MIN(BudgetPeriods!J:J))&\"/\"&YEAR(MIN(BudgetPeriods!J:J))&\" - \"&MONTH(MAX(BudgetPeriods!K:K))&\"/\"&DAY(MAX(BudgetPeriods!K:K))&\"/\"&YEAR(MAX(BudgetPeriods!K:K))","v":"Period of Performance: 1/0/1900 - 1/0/1900"},null,null,null,null,null,null,null,null,null,null,null,null,null,null,null,null,null,null,null,null,null,null,null,null,null,null,null,null,null,"Total Project Costs (USDA TFF)"]
[{"$f":"\"Deadline: \"&MONTH(BudgetPeriods!I2)&\"/\"&DAY(BudgetPeriods!I2)&\"/\"&YEAR(BudgetPeriods!I2)","v":"Deadline: 1/0/1900"},null,null,null,null,null,null,null,null,null,null,null,null,null,null,null,null,null,null,null,null,null,null,null,null,null,null,null,null,null,"Other MTDC"]
[null,null,null,null,null,null,null,1,1,2,2,3,3,4,4,5,5,6,6,7,7,8,8,9,9,10,10]
[{"$f":"\"Proposal Identification: \"&BudgetCalcs!B1","v":"Proposal Identification: 0"},null,null,null,null,null,null,{"$f":"IF(BudgetCalcs!$B$2>=H$8,BudgetCalcs!$F$9&\" \"&H$8,\"\")","v":""},null,{"$f":"IF(BudgetCalcs!$B$2>=J$8,BudgetCalcs!$F$9&\" \"&J$8,\"\")","v":""},null,{"$f":"IF(BudgetCalcs!$B$2>=L$8,BudgetCalcs!$F$9&\" \"&L$8,\"\")","v":""},null,{"$f":"IF(BudgetCalcs!$B$2>=N$8,BudgetCalcs!$F$9&\" \"&N$8,\"\")","v":""},null,{"$f":"IF(BudgetCalcs!$B$2>=P$8,BudgetCalcs!$F$9&\" \"&P$8,\"\")","v":""},null,{"$f":"IF(BudgetCalcs!$B$2>=R$8,BudgetCalcs!$F$9&\" \"&R$8,\"\")","v":""},null,{"$f":"IF(BudgetCalcs!$B$2>=T$8,BudgetCalcs!$F$9&\" \"&T$8,\"\")","v":""},null,{"$f":"IF(BudgetCalcs!$B$2>=V$8,BudgetCalcs!$F$9&\" \"&V$8,\"\")","v":""},null,{"$f":"IF(BudgetCalcs!$B$2>=X$8,BudgetCalcs!$F$9&\" \"&X$8,\"\")","v":""},null,{"$f":"IF(BudgetCalcs!$B$2>=Z$8,BudgetCalcs!$F$9&\" \"&Z$8,\"\")","v":""},null,"Total Sponsor Funds","Total Cost-Shared Matching Funds","Total Project Funds"]
[null,null,null,null,null,null,null,"Start Date","End Date","Start Date","End Date","Start Date","End Date","Start Date ","End Date","Start Date ","End Date","Start Date ","End Date","Start Date ","End Date","Start Date ","End Date","Start Date ","End Date","Start Date","End Date"]
{"$rows_left_out":154}
{"sheet":"Editable Summary","index":3,"n_rows":163,"n_cols":30,"rows_kept":163,"cut":false,"hidden":false,"merged":[[8,21,8,22],[8,23,8,24],[8,25,8,26],[8,15,8,16],[8,17,8,18],[8,19,8,20],[8,27,11,27],[8,28,11,28],[8,29,11,29],[0,28,0,29],[1,28,1,29],[3,0,3,8],[8,7,8,8],[8,9,8,10],[8,11,8,12],[8,13,8,14]]}
["Project Budget Worksheet - Iowa State University of Science and Technology",null,null,null,null,null,null,null,null,null,null,null,null,null,null,null,null,null,null,null,null,null,null,null,null,null,null,null,{"$f":"\"Version: \"&'Version Record'!$B$1","v":"Version: 2.06"}]
[null,null,null,null,null,null,null,null,null,null,null,null,null,null,null,null,null,null,null,null,null,null,null,null,null,null,null,null,{"$f":"\"Updated: \"& MONTH('Version Record'!$B$2)&\"/\"&DAY('Version Record'!$B$2)&\"/\"&YEAR('Version Record'!$B$2)","v":"Updated: 7/19/2024"}]
["Program Sponsor: NIH-NATIONAL INSTITUTES OF HEALTH"]
["Title: Test NIH for MIP training"]
["PI: James M Reecy"]
["Period of Performance: 10/1/2024 - 9/30/2027"]
["Deadline: 3/5/2024"]
[null,null,null,null,null,null,null,1,1,2,2,3,3,4,4,5,5,6,6,7,7,8,8,9,9,10,10]
["Proposal Identification: 1969",null,null,null,null,null,null,"Period 1",null,"",null,"",null,"",null,"",null,"",null,"",null,"",null,"",null,"",null,"Total Sponsor Funds","Total Cost-Shared Matching Funds","Total Project Funds"]
[null,null,null,null,null,null,null,"Start Date","End Date","Start Date","End Date","Start Date","End Date","Start Date ","End Date","Start Date ","End Date","Start Date ","End Date","Start Date ","End Date","Start Date ","End Date","Start Date ","End Date","Start Date","End Date"]
{"$rows_left_out":154}
{"sheet":"SPA Budget","index":4,"n_rows":53,"n_cols":17,"rows_kept":53,"cut":false,"hidden":false,"merged":[[3,0,3,6],[8,14,10,14],[0,13,0,14],[1,13,1,14]]}
[{"$f":"\"Project Budget Worksheet - \"&BudgetCalcs!F11","v":"Project Budget Worksheet - Iowa State University of Science and Technology"},null,null,null,null,null,null,null,null,null,null,null,null,{"$f":"\"Version: \"&'Version Record'!$B$1","v":"Version: 2.06"}]
[null,null,null,null,null,null,null,null,null,null,null,null,null,{"$f":"\"Updated: \"& MONTH('Version Record'!$B$2)&\"/\"&DAY('Version Record'!$B$2)&\"/\"&YEAR('Version Record'!$B$2)","v":"Updated: 7/19/2024"}]
[{"$f":"\"Program Sponsor: \"&BudgetPeriods!G2","v":"Program Sponsor: "}]
[{"$f":"\"Title: \"&BudgetPeriods!F2","v":"Title: "},null,null,null,null,null,null,null,null,null,null,null,null,null,null,"Negotiated Rate","Yes"]
[{"$f":"\"PI: \"&BudgetPeriods!H2","v":"PI: "},null,null,null,null,null,null,null,null,null,null,null,null,null,null,"Other TDC","No"]
[{"$f":"\"Period of Performance: \"&MONTH(MIN(BudgetPeriods!J:J))&\"/\"&DAY(MIN(BudgetPeriods!J:J))&\"/\"&YEAR(MIN(BudgetPeriods!J:J))&\" - \"&MONTH(MAX(BudgetPeriods!K:K))&\"/\"&DAY(MAX(BudgetPeriods!K:K))&\"/\"&YEAR(MAX(BudgetPeriods!K:K))","v":"Period of Performance: 1/0/1900 - 1/0/1900"},null,null,null,null,null,null,null,null,null,null,null,null,null,null,"Total Project Costs (USDA TFF)"]
[null,null,null,null,null,null,null,null,null,null,null,null,null,null,null,"Other MTDC"]
[null,null,null,null,1,2,3,4,5,6,7,8,9,10]
[{"$f":"\"Proposal Identification: \"&BudgetCalcs!B1","v":"Proposal Identification: 0"},null,null,null,{"$f":"IF(BudgetCalcs!$B$2>=E$8,BudgetCalcs!$F$9&\" \"&E$8,\"\")","v":""},{"$f":"IF(BudgetCalcs!$B$2>=F$8,BudgetCalcs!$F$9&\" \"&F$8,\"\")","v":""},{"$f":"IF(BudgetCalcs!$B$2>=G$8,BudgetCalcs!$F$9&\" \"&G$8,\"\")","v":""},{"$f":"IF(BudgetCalcs!$B$2>=H$8,BudgetCalcs!$F$9&\" \"&H$8,\"\")","v":""},{"$f":"IF(BudgetCalcs!$B$2>=I$8,BudgetCalcs!$F$9&\" \"&I$8,\"\")","v":""},{"$f":"IF(BudgetCalcs!$B$2>=J$8,BudgetCalcs!$F$9&\" \"&J$8,\"\")","v":""},{"$f":"IF(BudgetCalcs!$B$2>=K$8,BudgetCalcs!$F$9&\" \"&K$8,\"\")","v":""},{"$f":"IF(BudgetCalcs!$B$2>=L$8,BudgetCalcs!$F$9&\" \"&L$8,\"\")","v":""},{"$f":"IF(BudgetCalcs!$B$2>=M$8,BudgetCalcs!$F$9&\" \"&M$8,\"\")","v":""},{"$f":"IF(BudgetCalcs!$B$2>=N$8,BudgetCalcs!$F$9&\" \"&N$8,\"\")","v":""},"Total Project Costs"]
[null,null,null,"Start",{"$f":"IFERROR(INDIRECT(\"'BudgetPeriods'!B\"&MATCH(E$8,BudgetPeriods!$A:$A,0)),\"\")","v":""},{"$f":"IFERROR(INDIRECT(\"'BudgetPeriods'!B\"&MATCH(F$8,BudgetPeriods!$A:$A,0)),\"\")","v":""},{"$f":"IFERROR(INDIRECT(\"'BudgetPeriods'!B\"&MATCH(G$8,BudgetPeriods!$A:$A,0)),\"\")","v":""},{"$f":"IFERROR(INDIRECT(\"'BudgetPeriods'!B\"&MATCH(H$8,BudgetPeriods!$A:$A,0)),\"\")","v":""},{"$f":"IFERROR(INDIRECT(\"'BudgetPeriods'!B\"&MATCH(I$8,BudgetPeriods!$A:$A,0)),\"\")","v":""},{"$f":"IFERROR(INDIRECT(\"'BudgetPeriods'!B\"&MATCH(J$8,BudgetPeriods!$A:$A,0)),\"\")","v":""},{"$f":"IFERROR(INDIRECT(\"'BudgetPeriods'!B\"&MATCH(K$8,BudgetPeriods!$A:$A,0)),\"\")","v":""},{"$f":"IFERROR(INDIRECT(\"'BudgetPeriods'!B\"&MATCH(L$8,BudgetPeriods!$A:$A,0)),\"\")","v":""},{"$f":"IFERROR(INDIRECT(\"'BudgetPeriods'!B\"&MATCH(M$8,BudgetPeriods!$A:$A,0)),\"\")","v":""},{"$f":"IFERROR(INDIRECT(\"'BudgetPeriods'!B\"&MATCH(N$8,BudgetPeriods!$A:$A,0)),\"\")","v":""}]
{"$rows_left_out":44}
{"sheet":"Editable SPA Budget","index":5,"n_rows":53,"n_cols":17,"rows_kept":53,"cut":false,"hidden":false,"merged":[[0,13,0,14],[1,13,1,14],[8,14,10,14],[3,0,3,6]]}
["Project Budget Worksheet - Iowa State University of Science and Technology",null,null,null,null,null,null,null,null,null,null,null,null,{"$f":"\"Version: \"&'Version Record'!$B$1","v":"Version: 2.06"}]
[null,null,null,null,null,null,null,null,null,null,null,null,null,{"$f":"\"Updated: \"& MONTH('Version Record'!$B$2)&\"/\"&DAY('Version Record'!$B$2)&\"/\"&YEAR('Version Record'!$B$2)","v":"Updated: 7/19/2024"}]
["Program Sponsor: USDA-NATIONAL INSTITUTE OF FOOD & AGRICULTURE (NIFA)"]
["Title: Systems-based integrated approach to demonstrating, promoting and enhancing the sustainability of dairy goat production in the United States",null,null,null,null,null,null,null,null,null,null,null,null,null,null,"Negotiated Rate","Yes"]
["PI: Paul J Plummer",null,null,null,null,null,null,null,null,null,null,null,null,null,null,"Other TDC","No"]
["Period of Performance: 1/1/2024 - 12/31/2028",null,null,null,null,null,null,null,null,null,null,null,null,null,null,"Total Project Costs (USDA TFF)"]
[null,null,null,null,null,null,null,null,null,null,null,null,null,null,null,"Other MTDC"]
[null,null,null,null,1,2,3,4,5,6,7,8,9,10]
["Proposal Identification: 92",null,null,null,"Period 1","Period 2","Period 3","Period 4","Period 5","","","","","","Total Project Costs"]
[null,null,null,"Start","2024-01-01","2025-01-01","2026-01-01","2027-01-01","2028-01-01","","","","",""]
{"$rows_left_out":44}
{"sheet":"Version Record","index":6,"n_rows":33,"n_cols":14,"rows_kept":33,"cut":false,"hidden":false,"merged":[]}
["Current Version",2.06]
["Released","2024-07-19"]
[]
["Version","Released","Changes",null,null,null,null,null,null,null,null,null,"Future enhancements:"]
[1,"2023-05-11",null,null,null,null,null,null,null,null,null,null,null,"autoload & copy data from the report workbook to this workbook"]
[2,"2023-05-23","Requires use of new Streamlyne Budget Export to Excel by PD-V2"]
[null,null,"remove Monthly Salary column from Key Personnel and Other Personnel sections"]
[null,null,"remove 0's from Number of Persons column in the Other Personnel section when empty"]
[null,null,"increase max number of Key and Other Personnel from 15 to 20"]
[null,null,"Merge Title to end of column I, wrap text and align top/left"]
{"$rows_left_out":24}
{"sheet":"BudgetCalcs","index":7,"n_rows":33,"n_cols":24,"rows_kept":33,"cut":false,"hidden":true,"merged":[[32,15,32,19],[14,7,14,8],[21,1,22,3],[14,21,14,22],[22,15,23,17],[20,21,21,22]]}
["PD",{"$f":"'Streamlyne Budget Export to Exc'!A2","v":0},null,null,null,"Budget Category Code","Budget Category Type Code","Domestic Travel Budget Category Code","Foreign Travel Budget Category Code","Stipend Budget Category Code","Travel Budget Category Code","Subsistence Budget Category Code","Tuition Budget Category Code","Other Budget Category Code"]
["Budget Periods",{"$f":"MAX('Streamlyne Budget Export to Exc'!B:B)","v":0},null,null,"Sr Persons",1,"P"]
["Total Budget Lines ",{"$f":"COUNTA('Streamlyne Budget Export to Exc'!A:A)","v":1},null,null,"other Persons",{"$f":"\"<> \"&F2","v":"<> 1"},"P"]
["Total Report Columns",{"$f":"IF(INT((C4-1)/26)<1,MID(\"ABCDEFGHIJKLMNOPQRSTUVWXYZ\",C4,1),\"A\"&MID(\"ABCDEFGHIJKLMNOPQRSTUVWXYZ\",MOD(C4,26),1))","v":"AF"},{"$f":"COUNTA('Streamlyne Budget Export to Exc'!1:1)","v":32},null,"Equipment",null,"E"]
["Total Budget Columns",{"$f":"IF(INT((C5-1)/26)<1,MID(\"ABCDEFGHIJKLMNOPQRSTUVWXYZ\",C5,1),\"A\"&MID(\"ABCDEFGHIJKLMNOPQRSTUVWXYZ\",MOD(C5,26),1))","v":"Z"},{"$f":"C4-6","v":26},null,"Participant Support",null,"S",null,null,32,31,36,35,2]
["Sr Persons Filter Areas",{"$f":"\"B2:\"&B$5&(B$3)","v":"B2:Z1"},{"$f":"\"F2:F\"&(B3)","v":"F2:F1"},null,"Travel",null,"T",7,23]
["Other Persons Filter Areas",{"$f":"\"B2:\"&B$5&(B$3)","v":"B2:Z1"},{"$f":"\"E2:E\"&(B3)","v":"E2:E1"},null,"Other Direct",null,"O"]
["Budget Period Filter Area"]
["OH Type",{"$f":"OFFSET('Streamlyne Budget Export to Exc'!Y1,MATCH(\"O\",'Streamlyne Budget Export to Exc'!S:S,0)-1,0)","v":{"$error":"#N/A"}},null,null,"Rename Budget Period ","Period"]
[]
{"$rows_left_out":24}
{"sheet":"SrPersons","index":8,"n_rows":2,"n_cols":28,"rows_kept":2,"cut":false,"hidden":true,"merged":[]}
["Key Persons",{"$f":"COUNTA(D:D)","v":2},{"$f":"COUNTA(A:A)","v":2},"Budget Period","Budget Period Start Date","Budget Period End Date","CATEGORY  TYPE","BUDGET  CATEGORY  CODE","Budget Category","Person Name","PI Flag","% Charged","% Effort","Cost Element","Cost Element Desc","Line Item Desc","Rate Type Desc","Requested Salary","Line Item Cost","Calculated Cost","RATE  CLASS  TYPE","RATE  CLASS  CODE","RATE  TYPE  CODE","Calculated Cost Sharing","Cost Sharing Amount","Underrecovery Amount","RATE  TYPE  DESCRIPTION","Person Months"]
[{"$f":"_xlfn.UNIQUE(INDIRECT(\"J2:K\"&B1))","v":0},0,null,{"$f":"_xlfn._xlws.FILTER(INDIRECT(\"'Streamlyne Budget Export to Exc'!\"&BudgetCalcs!B6),INDIRECT(\"'Streamlyne Budget Export to Exc'!\"&BudgetCalcs!C6)=BudgetCalcs!F2,)","v":{"$error":"#VALUE!"}}]

{"sheet":"OtherPersons","index":9,"n_rows":2,"n_cols":29,"rows_kept":2,"cut":false,"hidden":true,"merged":[]}
["Other Persons",{"$f":"COUNTA(E:E)","v":2},{"$f":"COUNTA(A:A)","v":2},null,"Budget Period","Budget Period Start Date","Budget Period End Date","CATEGORY  TYPE","BUDGET  CATEGORY  CODE","Budget Category","Person Name","PI Flag","% Charged","% Effort","Cost Element","Cost Element Desc","Line Item Desc","Rate Type Desc","Requested Salary","Line Item Cost","Calculated Cost","RATE  CLASS  TYPE","RATE  CLASS  CODE","RATE  TYPE  CODE","Calculated Cost Sharing","Cost Sharing Amount","Underrecovery Amount","RATE  TYPE  DESCRIPTION","Person Months"]
[{"$f":"_xlfn.UNIQUE(INDIRECT(\"J2:J\"&B1))","v":0},{"$f":"_xlfn.UNIQUE(INDIRECT(\"J2:K\"&B1))","v":0},0,null,{"$f":"_xlfn._xlws.FILTER(INDIRECT(\"'Streamlyne Budget Export to Exc'!\"&BudgetCalcs!B7),(INDIRECT(\"'Streamlyne Budget Export to Exc'!\"&BudgetCalcs!C7)=BudgetCalcs!G3)*(INDIRECT(\"'Streamlyne Budget Export to Exc'!\"&BudgetCalcs!C6)<>BudgetCalcs!F2),)","v":{"$error":"#VALUE!"}}]

{"sheet":"OtherPersonsCalc","index":10,"n_rows":17,"n_cols":19,"rows_kept":17,"cut":false,"hidden":true,"merged":[]}
["Budget Period","Budget Period Start Date","Budget Period End Date","CATEGORY  TYPE","BUDGET  CATEGORY  CODE","Budget Category","Person Name",null,{"$f":"INDIRECT(\"'OtherPersons'!A1:A\"&OtherPersons!C1)","v":"Other Persons"},1,2,3,4,5,6,7,8,9,10]
[{"$f":"_xlfn.UNIQUE(INDIRECT(\"'OtherPersons'!E2:K\"&OtherPersons!B1))","v":{"$error":"#VALUE!"}},"00:00:00","00:00:00",0,0,0,0,null,0,{"$f":"COUNTIFS($A:$A,J$1,$F:$F,$I2)","v":0},{"$f":"COUNTIFS($A:$A,K$1,$F:$F,$I2)","v":0},0,0,0,0,0,0,0,0]
[null,null,null,null,null,null,null,null,null,{"$f":"COUNTIFS($A:$A,J$1,$F:$F,$I3)","v":0},0,0,0,0,0,0,0,0,0]
[null,null,null,null,null,null,null,null,null,0,0,0,0,0,0,0,0,0,0]
[null,null,null,null,null,null,null,null,null,0,0,0,0,0,0,0,0,0,0]
[null,null,null,null,null,null,null,null,null,0,0,0,0,0,0,0,0,0,0]
[null,null,null,null,null,null,null,null,null,0,0,0,0,0,0,0,0,0,0]
[null,null,null,null,null,null,null,null,null,0,0,0,0,0,0,0,0,0,0]
[null,null,null,null,null,null,null,null,null,0,0,0,0,0,0,0,0,0,0]
[null,null,null,null,null,null,null,null,null,0,0,0,0,0,0,0,0,0,0]
{"$rows_left_out":8}
{"sheet":"Equipment","index":11,"n_rows":2,"n_cols":25,"rows_kept":2,"cut":false,"hidden":true,"merged":[]}
["Budget Period","Budget Period Start Date","Budget Period End Date","CATEGORY  TYPE","BUDGET  CATEGORY  CODE","Budget Category","Person Name","PI Flag","% Charged","% Effort","Cost Element","Cost Element Desc","Line Item Desc","Rate Type Desc","Requested Salary","Line Item Cost","Calculated Cost","RATE  CLASS  TYPE","RATE  CLASS  CODE","RATE  TYPE  CODE","Calculated Cost Sharing","Cost Sharing Amount","Underrecovery Amount","RATE  TYPE  DESCRIPTION","Person Months"]
[{"$f":"_xlfn._xlws.FILTER(INDIRECT(\"'Streamlyne Budget Export to Exc'!\"&BudgetCalcs!B7),INDIRECT(\"'Streamlyne Budget Export to Exc'!\"&BudgetCalcs!C7)=BudgetCalcs!G4,)","v":{"$error":"#VALUE!"}}]

{"sheet":"Part Support","index":12,"n_rows":2,"n_cols":25,"rows_kept":2,"cut":false,"hidden":true,"merged":[]}
["Budget Period","Budget Period Start Date","Budget Period End Date","CATEGORY  TYPE","BUDGET  CATEGORY  CODE","Budget Category","Person Name","PI Flag","% Charged","% Effort","Cost Element","Cost Element Desc","Line Item Desc","Rate Type Desc","Requested Salary","Line Item Cost","Calculated Cost","RATE  CLASS  TYPE","RATE  CLASS  CODE","RATE  TYPE  CODE","Calculated Cost Sharing","Cost Sharing Amount","Underrecovery Amount","RATE  TYPE  DESCRIPTION","Person Months"]
[{"$f":"_xlfn._xlws.FILTER(INDIRECT(\"'Streamlyne Budget Export to Exc'!\"&BudgetCalcs!B7),INDIRECT(\"'Streamlyne Budget Export to Exc'!\"&BudgetCalcs!C7)=BudgetCalcs!G5,)","v":{"$error":"#VALUE!"}}]

{"sheet":"Travel","index":13,"n_rows":2,"n_cols":25,"rows_kept":2,"cut":false,"hidden":true,"merged":[]}
["Budget Period","Budget Period Start Date","Budget Period End Date","CATEGORY  TYPE","BUDGET  CATEGORY  CODE","Budget Category","Person Name","PI Flag","% Charged","% Effort","Cost Element","Cost Element Desc","Line Item Desc","Rate Type Desc","Requested Salary","Line Item Cost","Calculated Cost","RATE  CLASS  TYPE","RATE  CLASS  CODE","RATE  TYPE  CODE","Calculated Cost Sharing","Cost Sharing Amount","Underrecovery Amount","RATE  TYPE  DESCRIPTION","Person Months"]
[{"$f":"_xlfn._xlws.FILTER(INDIRECT(\"'Streamlyne Budget Export to Exc'!\"&BudgetCalcs!B7),INDIRECT(\"'Streamlyne Budget Export to Exc'!\"&BudgetCalcs!C7)=BudgetCalcs!G6,)","v":{"$error":"#VALUE!"}}]

{"sheet":"Other","index":14,"n_rows":2,"n_cols":25,"rows_kept":2,"cut":false,"hidden":true,"merged":[]}
["Budget Period","Budget Period Start Date","Budget Period End Date","CATEGORY  TYPE","BUDGET  CATEGORY  CODE","Budget Category","Person Name","PI Flag","% Charged","% Effort","Cost Element","Cost Element Desc","Line Item Desc","Rate Type Desc","Requested Salary","Line Item Cost","Calculated Cost","RATE  CLASS  TYPE","RATE  CLASS  CODE","RATE  TYPE  CODE","Calculated Cost Sharing","Cost Sharing Amount","Underrecovery Amount","RATE  TYPE  DESCRIPTION","Person Months"]
[{"$f":"_xlfn._xlws.FILTER(INDIRECT(\"'Streamlyne Budget Export to Exc'!\"&BudgetCalcs!B7),INDIRECT(\"'Streamlyne Budget Export to Exc'!\"&BudgetCalcs!C7)=BudgetCalcs!G7,)","v":{"$error":"#VALUE!"}}]

{"sheet":"BudgetPeriods","index":15,"n_rows":1,"n_cols":11,"rows_kept":1,"cut":false,"hidden":true,"merged":[]}
[{"$f":"_xlfn.UNIQUE(INDIRECT(\"'Streamlyne Budget Export to Exc'!B1:D\"&BudgetCalcs!B3),)","v":"Budget Period"},"Budget Period Start Date","Budget Period End Date",null,null,{"$f":"_xlfn.UNIQUE(INDIRECT(\"'Streamlyne Budget Export to Exc'!AA1:AF\"&BudgetCalcs!B3),)","v":"TITLE"},"SPONSOR  NAME","PI  FULL  NAME","DEADLINE  DATE","START  DATE","END  DATE"]